[dpdk-test-report] |FAILURE| pw17448 [PATCH, 29/31] net/i40e: parse more VF parameter and configure

sys_stv at intel.com sys_stv at intel.com
Fri Dec 2 18:07:35 CET 2016


Test-Label: Intel Per-patch compilation check
Test-Status: FAILURE

http://www.dpdk.org/dev/patchwork/patch/17448
Submitter: Wenzhuo Lu <wenzhuo.lu at intel.com>
Date: Thu,  1 Dec 2016 19:12:00 -0500
DPDK git baseline: Repo:dpdk, Branch:master, CommitID:112fc39b829039ee4ade210c464d26fecde7eac0

Patch17420-17448 --> compile error
Build Summary: 18 Builds Done, 14 Successful, 4 Failures

Test environment and configuration as below:
OS: FreeBSD10.3_64
    Kernel Version:10.3-RELEASE
    CPU info:CPU: Intel(R) Xeon(R) CPU E5-2699 v4 @ 2.20GHz (2194.97-MHz K8-class CPU)
    GCC Version:gcc (FreeBSD Ports Collection) 4.8.5
    Clang Version:3.4.1
    x86_64-native-bsdapp-clang
    x86_64-native-bsdapp-gcc
OS: RHEL7.2_64
    Kernel Version:3.10.0-327.el7.x86_64
    CPU info:Intel(R) Xeon(R) CPU E5-2699 v4 @ 2.20GHz
    GCC Version:gcc (GCC) 4.8.5 20150623 (Red Hat 4.8.5-4)
    Clang Version:3.4.2
    i686-native-linuxapp-gcc
    x86_64-native-linuxapp-gcc
    x86_64-native-linuxapp-gcc-shared
OS: UB1604_64
    Kernel Version:4.4.0-47-generic
    CPU info:Intel(R) Xeon(R) CPU E5-2699 v3 @ 2.30GHz
    GCC Version:gcc (Ubuntu 5.4.0-6ubuntu1~16.04.4) 5.4.0 20160609
    Clang Version:3.8.0
    i686-native-linuxapp-gcc
    x86_64-native-linuxapp-clang
    x86_64-native-linuxapp-gcc-shared
    x86_64-native-linuxapp-gcc
OS: CentOS7_64
    Kernel Version:3.10.0-327.el7.x86_64
    CPU info:Intel(R) Xeon(R) CPU E5-2699 v3 @ 2.30GHz
    GCC Version:gcc (GCC) 4.8.5 20150623 (Red Hat 4.8.5-4)
    Clang Version:3.4.2
    i686-native-linuxapp-gcc
    x86_64-native-linuxapp-clang
    x86_64-native-linuxapp-gcc-shared
    x86_64-native-linuxapp-gcc
OS: FC24_64
    Kernel Version:4.8.6-201.fc24.x86_64
    CPU info:Intel(R) Xeon(R) CPU E5-2699 v3 @ 2.30GHz
    GCC Version:gcc (GCC) 6.2.1 20160916 (Red Hat 6.2.1-2)
    Clang Version:3.8.0
    x86_64-native-linuxapp-gcc-debug
    i686-native-linuxapp-gcc
    x86_64-native-linuxapp-clang
    x86_64-native-linuxapp-gcc-shared
    x86_64-native-linuxapp-gcc

Failed Build #1:
OS: RHEL7.2_64
Target: x86_64-native-linuxapp-gcc-shared

cmdline.o: In function `cmd_set_vf_vlan_anti_spoof_parsed':
cmdline.c:(.text+0x4067): undefined reference to `rte_pmd_i40e_set_vf_vlan_anti_spoof'
cmdline.o: In function `cmd_set_vf_mac_anti_spoof_parsed':
cmdline.c:(.text+0x41d6): undefined reference to `rte_pmd_i40e_set_vf_mac_anti_spoof'
cmdline.o: In function `cmd_set_vf_vlan_stripq_parsed':
cmdline.c:(.text+0x4346): undefined reference to `rte_pmd_i40e_set_vf_vlan_stripq'
cmdline.o: In function `cmd_set_vf_vlan_insert_parsed':
cmdline.c:(.text+0x448a): undefined reference to `rte_pmd_i40e_set_vf_vlan_insert'
cmdline.o: In function `cmd_set_tx_loopback_parsed':
cmdline.c:(.text+0x45ff): undefined reference to `rte_pmd_i40e_set_tx_loopback'
cmdline.o: In function `cmd_set_vf_unicast_promisc_parsed':
cmdline.c:(.text+0x4782): undefined reference to `rte_pmd_i40e_set_vf_unicast_promisc'
cmdline.o: In function `cmd_set_vf_multicast_promisc_parsed':
cmdline.c:(.text+0x4832): undefined reference to `rte_pmd_i40e_set_vf_multicast_promisc'
cmdline.o: In function `cmd_set_vf_broadcast_parsed':
cmdline.c:(.text+0x48ea): undefined reference to `rte_pmd_i40e_set_vf_broadcast'
cmdline.o: In function `cmd_set_vf_vlan_tag_parsed':
cmdline.c:(.text+0x49ba): undefined reference to `rte_pmd_i40e_set_vf_vlan_tag'
config.o: In function `set_vf_rx_vlan':
config.c:(.text+0x507a): undefined reference to `rte_pmd_i40e_set_vf_vlan_filter'
collect2: error: ld returned 1 exit status


Failed Build #2:
OS: UB1604_64
Target: x86_64-native-linuxapp-gcc-shared

cmdline.o: In function `cmd_set_vf_unicast_promisc_parsed':
cmdline.c:(.text+0x2e6a): undefined reference to `rte_pmd_i40e_set_vf_unicast_promisc'
cmdline.o: In function `cmd_set_vf_multicast_promisc_parsed':
cmdline.c:(.text+0x2f3a): undefined reference to `rte_pmd_i40e_set_vf_multicast_promisc'
cmdline.o: In function `cmd_set_vf_broadcast_parsed':
cmdline.c:(.text+0x3012): undefined reference to `rte_pmd_i40e_set_vf_broadcast'
cmdline.o: In function `cmd_set_vf_vlan_tag_parsed':
cmdline.c:(.text+0x3102): undefined reference to `rte_pmd_i40e_set_vf_vlan_tag'
cmdline.o: In function `cmd_set_vf_vlan_anti_spoof_parsed':
cmdline.c:(.text+0x59f6): undefined reference to `rte_pmd_i40e_set_vf_vlan_anti_spoof'
cmdline.o: In function `cmd_set_vf_mac_anti_spoof_parsed':
cmdline.c:(.text+0x5b96): undefined reference to `rte_pmd_i40e_set_vf_mac_anti_spoof'
cmdline.o: In function `cmd_set_vf_vlan_stripq_parsed':
cmdline.c:(.text+0x5d36): undefined reference to `rte_pmd_i40e_set_vf_vlan_stripq'
cmdline.o: In function `cmd_set_vf_vlan_insert_parsed':
cmdline.c:(.text+0x5ea2): undefined reference to `rte_pmd_i40e_set_vf_vlan_insert'
cmdline.o: In function `cmd_set_tx_loopback_parsed':
cmdline.c:(.text+0x603f): undefined reference to `rte_pmd_i40e_set_tx_loopback'
config.o: In function `set_vf_rx_vlan':
config.c:(.text+0x564e): undefined reference to `rte_pmd_i40e_set_vf_vlan_filter'
collect2: error: ld returned 1 exit status
/home/patchWorkOrg/compilation/mk/rte.app.mk:231: recipe for target 'testpmd' failed
/home/patchWorkOrg/compilation/mk/rte.subdir.mk:61: recipe for target 'test-pmd' failed
/home/patchWorkOrg/compilation/mk/rte.sdkbuild.mk:78: recipe for target 'app' failed
/home/patchWorkOrg/compilation/mk/rte.sdkroot.mk:126: recipe for target 'all' failed
/home/patchWorkOrg/compilation/mk/rte.sdkinstall.mk:85: recipe for target 'pre_install' failed
/home/patchWorkOrg/compilation/mk/rte.sdkroot.mk:101: recipe for target 'install' failed


Failed Build #3:
OS: CentOS7_64
Target: x86_64-native-linuxapp-gcc-shared

cmdline.o: In function `cmd_set_vf_vlan_anti_spoof_parsed':
cmdline.c:(.text+0x4067): undefined reference to `rte_pmd_i40e_set_vf_vlan_anti_spoof'
cmdline.o: In function `cmd_set_vf_mac_anti_spoof_parsed':
cmdline.c:(.text+0x41d6): undefined reference to `rte_pmd_i40e_set_vf_mac_anti_spoof'
cmdline.o: In function `cmd_set_vf_vlan_stripq_parsed':
cmdline.c:(.text+0x4346): undefined reference to `rte_pmd_i40e_set_vf_vlan_stripq'
cmdline.o: In function `cmd_set_vf_vlan_insert_parsed':
cmdline.c:(.text+0x448a): undefined reference to `rte_pmd_i40e_set_vf_vlan_insert'
cmdline.o: In function `cmd_set_tx_loopback_parsed':
cmdline.c:(.text+0x45ff): undefined reference to `rte_pmd_i40e_set_tx_loopback'
cmdline.o: In function `cmd_set_vf_unicast_promisc_parsed':
cmdline.c:(.text+0x4782): undefined reference to `rte_pmd_i40e_set_vf_unicast_promisc'
cmdline.o: In function `cmd_set_vf_multicast_promisc_parsed':
cmdline.c:(.text+0x4832): undefined reference to `rte_pmd_i40e_set_vf_multicast_promisc'
cmdline.o: In function `cmd_set_vf_broadcast_parsed':
cmdline.c:(.text+0x48ea): undefined reference to `rte_pmd_i40e_set_vf_broadcast'
cmdline.o: In function `cmd_set_vf_vlan_tag_parsed':
cmdline.c:(.text+0x49ba): undefined reference to `rte_pmd_i40e_set_vf_vlan_tag'
config.o: In function `set_vf_rx_vlan':
config.c:(.text+0x507a): undefined reference to `rte_pmd_i40e_set_vf_vlan_filter'
collect2: error: ld returned 1 exit status


Failed Build #4:
OS: FC24_64
Target: x86_64-native-linuxapp-gcc-shared

cmdline.o: In function `cmd_set_vf_vlan_anti_spoof_parsed':
cmdline.c:(.text+0x4c16): undefined reference to `rte_pmd_i40e_set_vf_vlan_anti_spoof'
cmdline.o: In function `cmd_set_vf_mac_anti_spoof_parsed':
cmdline.c:(.text+0x4d86): undefined reference to `rte_pmd_i40e_set_vf_mac_anti_spoof'
cmdline.o: In function `cmd_set_vf_vlan_stripq_parsed':
cmdline.c:(.text+0x4ef6): undefined reference to `rte_pmd_i40e_set_vf_vlan_stripq'
cmdline.o: In function `cmd_set_vf_vlan_insert_parsed':
cmdline.c:(.text+0x503a): undefined reference to `rte_pmd_i40e_set_vf_vlan_insert'
cmdline.o: In function `cmd_set_tx_loopback_parsed':
cmdline.c:(.text+0x51af): undefined reference to `rte_pmd_i40e_set_tx_loopback'
cmdline.o: In function `cmd_set_vf_unicast_promisc_parsed':
cmdline.c:(.text+0x532a): undefined reference to `rte_pmd_i40e_set_vf_unicast_promisc'
cmdline.o: In function `cmd_set_vf_multicast_promisc_parsed':
cmdline.c:(.text+0x53ea): undefined reference to `rte_pmd_i40e_set_vf_multicast_promisc'
cmdline.o: In function `cmd_set_vf_broadcast_parsed':
cmdline.c:(.text+0x54b2): undefined reference to `rte_pmd_i40e_set_vf_broadcast'
cmdline.o: In function `cmd_set_vf_vlan_tag_parsed':
cmdline.c:(.text+0x5582): undefined reference to `rte_pmd_i40e_set_vf_vlan_tag'
config.o: In function `set_vf_rx_vlan':
config.c:(.text+0x4f4d): undefined reference to `rte_pmd_i40e_set_vf_vlan_filter'
collect2: error: ld returned 1 exit status
/home/patchWorkOrg/compilation/mk/rte.app.mk:231: recipe for target 'testpmd' failed
/home/patchWorkOrg/compilation/mk/rte.subdir.mk:61: recipe for target 'test-pmd' failed
/home/patchWorkOrg/compilation/mk/rte.sdkbuild.mk:78: recipe for target 'app' failed
/home/patchWorkOrg/compilation/mk/rte.sdkroot.mk:126: recipe for target 'all' failed
/home/patchWorkOrg/compilation/mk/rte.sdkinstall.mk:85: recipe for target 'pre_install' failed
/home/patchWorkOrg/compilation/mk/rte.sdkroot.mk:101: recipe for target 'install' failed


DPDK STV team


More information about the test-report mailing list