[dpdk-test-report] | ERROR | daily Intel builds (7/35)

sys_stv at intel.com sys_stv at intel.com
Sun Jun 26 23:26:25 CEST 2016


Last commit Time   : Fri Jun 24 16:57:27 2016 +0200
Last Author        : Thomas Monjalon
Last commit Hash   : c175e542c0c3ba6f62a3ef9a932cb7ea27ee0852
Last comment       : mk: fix parallel build of test resources

Build Summary      : 35 Builds Done, 7 Successful, 28 Failures.

Failure details    : 

Failure #1
UBT144_32 / Linux 3.13.0-30 / GCC 4.8.2
Config: i686-native-linuxapp-gcc
        CONFIG_RTE_LIBRTE_PMD_PCAP=y,
        CONFIG_RTE_NIC_BYPASS=y,
        CONFIG_RTE_BUILD_SHARED_LIB=y,
        CONFIG_RTE_LIBRTE_VHOST=y

LD librte_port.so.3.1
/usr/bin/ld: cannot find -lrte_kni
collect2: error: ld returned 1 exit status

Failure #2
UBT144_32 / Linux 3.13.0-30 / ICC 14.0.0
Config: i686-native-linuxapp-icc
        CONFIG_RTE_LIBRTE_PMD_PCAP=y,
        CONFIG_RTE_NIC_BYPASS=y,
        CONFIG_RTE_BUILD_SHARED_LIB=y,
        CONFIG_RTE_LIBRTE_VHOST=y

LD librte_port.so.3.1
/usr/bin/ld: cannot find -lrte_kni
collect2: error: ld returned 1 exit status

Failure #3
SUSE11SP2_64 / Linux 3.0.13-0 / GCC 4.5.1
Config: x86_64-native-linuxapp-gcc
        CONFIG_RTE_LIBRTE_PMD_PCAP=y,
        CONFIG_RTE_NIC_BYPASS=y,
        CONFIG_RTE_BUILD_SHARED_LIB=y,
        CONFIG_RTE_LIBRTE_VHOST=y

DPDK/drivers/net/virtio/virtio_user/virtio_user_dev.c: In function ‘virtio_user_kick_queue’:
DPDK/drivers/net/virtio/virtio_user/virtio_user_dev.c:66:22: error: ‘O_CLOEXEC’ undeclared (first use in this function)
compilation terminated due to -Wfatal-errors.

Failure #4
SUSE11SP2_64 / Linux 3.0.13-0 / ICC 14.0.0
Config: x86_64-native-linuxapp-icc
        CONFIG_RTE_LIBRTE_PMD_PCAP=y,
        CONFIG_RTE_NIC_BYPASS=y,
        CONFIG_RTE_BUILD_SHARED_LIB=y,
        CONFIG_RTE_LIBRTE_VHOST=y

DPDK/drivers/net/virtio/virtio_user/virtio_user_dev.c: In function ‘virtio_user_kick_queue’:
DPDK/drivers/net/virtio/virtio_user/virtio_user_dev.c:66:22: error: ‘O_CLOEXEC’ undeclared (first use in this function)
compilation terminated due to -Wfatal-errors.

Failure #5
SUSE11SP2_64 / Linux 3.0.13-0 / GCC 4.5.1
Config: x86_64-native-ivshmem-gcc

DPDK/lib/librte_ivshmem/rte_ivshmem.c: In function ‘add_mempool_to_metadata’:
DPDK/lib/librte_ivshmem/rte_ivshmem.c:584:32: error: ‘const struct rte_mempool’ has no member named ‘ring’
compilation terminated due to -Wfatal-errors.

Failure #6
SUSE11SP2_64 / Linux 3.0.13-0 / ICC 14.0.0
Config: x86_64-native-ivshmem-icc

DPDK/lib/librte_ivshmem/rte_ivshmem.c: In function ‘add_mempool_to_metadata’:
DPDK/lib/librte_ivshmem/rte_ivshmem.c:584:32: error: ‘const struct rte_mempool’ has no member named ‘ring’
compilation terminated due to -Wfatal-errors.

Failure #7
FC20_32 / Linux 3.11.0 / GCC 4.8.3
Config: i686-native-linuxapp-gcc
        CONFIG_RTE_LIBRTE_PMD_PCAP=y,
        CONFIG_RTE_NIC_BYPASS=y,
        CONFIG_RTE_BUILD_SHARED_LIB=y,
        CONFIG_RTE_LIBRTE_VHOST=y

LD librte_port.so.3.1
/usr/bin/ld: cannot find -lrte_kni
collect2: error: ld returned 1 exit status

Failure #8
FC20_32 / Linux 3.11.0 / ICC 14.0.0
Config: i686-native-linuxapp-icc
        CONFIG_RTE_LIBRTE_PMD_PCAP=y,
        CONFIG_RTE_NIC_BYPASS=y,
        CONFIG_RTE_BUILD_SHARED_LIB=y,
        CONFIG_RTE_LIBRTE_VHOST=y

LD librte_port.so.3.1
/usr/bin/ld: cannot find -lrte_kni
collect2: error: ld returned 1 exit status

Failure #9
UBT124_64 / Linux 3.8.0-29 / ICC 14.0.0
Config: x86_64-native-linuxapp-icc
        CONFIG_RTE_LIBRTE_PMD_PCAP=y,
        CONFIG_RTE_NIC_BYPASS=y,
        CONFIG_RTE_BUILD_SHARED_LIB=y,
        CONFIG_RTE_LIBRTE_VHOST=y

DPDK/drivers/net/virtio/virtio_user/vhost_user.c(257): error #188: enumerated type mixed with another type
  	msg.request = req;
  	            ^
compilation aborted for DPDK/drivers/net/virtio/virtio_user/vhost_user.c (code 4)

Failure #10
UBT124_64 / Linux 3.8.0-29 / GCC 4.6.3
Config: x86_64-native-ivshmem-gcc

DPDK/lib/librte_ivshmem/rte_ivshmem.c: In function ‘add_mempool_to_metadata’:
DPDK/lib/librte_ivshmem/rte_ivshmem.c:584:32: error: ‘const struct rte_mempool’ has no member named ‘ring’
compilation terminated due to -Wfatal-errors.

Failure #11
UBT124_64 / Linux 3.8.0-29 / ICC 14.0.0
Config: x86_64-native-ivshmem-icc

DPDK/lib/librte_ivshmem/rte_ivshmem.c: In function ‘add_mempool_to_metadata’:
DPDK/lib/librte_ivshmem/rte_ivshmem.c:584:32: error: ‘const struct rte_mempool’ has no member named ‘ring’
compilation terminated due to -Wfatal-errors.

Failure #12
UBT144_64 / Linux 3.13.0-30 / ICC 14.0.0
Config: x86_64-native-linuxapp-icc
        CONFIG_RTE_LIBRTE_PMD_PCAP=y,
        CONFIG_RTE_NIC_BYPASS=y,
        CONFIG_RTE_BUILD_SHARED_LIB=y,
        CONFIG_RTE_LIBRTE_VHOST=y

DPDK/drivers/net/virtio/virtio_user/vhost_user.c(257): error #188: enumerated type mixed with another type
  	msg.request = req;
  	            ^
compilation aborted for DPDK/drivers/net/virtio/virtio_user/vhost_user.c (code 4)

Failure #13
UBT144_64 / Linux 3.13.0-30 / GCC 4.8.2
Config: x86_64-native-ivshmem-gcc

DPDK/lib/librte_ivshmem/rte_ivshmem.c: In function ‘add_mempool_to_metadata’:
DPDK/lib/librte_ivshmem/rte_ivshmem.c:584:32: error: ‘const struct rte_mempool’ has no member named ‘ring’
  return add_ring_to_metadata(mp->ring, config);
                                ^
compilation terminated due to -Wfatal-errors.

Failure #14
UBT144_64 / Linux 3.13.0-30 / ICC 14.0.0
Config: x86_64-native-ivshmem-icc

DPDK/lib/librte_ivshmem/rte_ivshmem.c: In function ‘add_mempool_to_metadata’:
DPDK/lib/librte_ivshmem/rte_ivshmem.c:584:32: error: ‘const struct rte_mempool’ has no member named ‘ring’
  return add_ring_to_metadata(mp->ring, config);
                                ^
compilation terminated due to -Wfatal-errors.

Failure #15
FC21_64 / Linux 3.18.8-201 / GCC 4.9.2
Config: x86_64-native-ivshmem-gcc

DPDK/lib/librte_ivshmem/rte_ivshmem.c: In function ‘add_mempool_to_metadata’:
DPDK/lib/librte_ivshmem/rte_ivshmem.c:584:32: error: ‘const struct rte_mempool’ has no member named ‘ring’
  return add_ring_to_metadata(mp->ring, config);
                                ^
compilation terminated due to -Wfatal-errors.
DPDK/mk/internal/rte.compile-pre.mk:126: recipe for target 'rte_ivshmem.o' failed
DPDK/mk/rte.subdir.mk:61: recipe for target 'librte_ivshmem' failed
DPDK/mk/rte.sdkbuild.mk:77: recipe for target 'lib' failed
DPDK/mk/rte.sdkroot.mk:123: recipe for target 'all' failed
DPDK/mk/rte.sdkinstall.mk:84: recipe for target 'pre_install' failed
DPDK/mk/rte.sdkroot.mk:98: recipe for target 'install' failed

Failure #16
FC21_64 / Linux 3.18.8-201 / ICC 15.0.0
Config: x86_64-native-ivshmem-icc

DPDK/lib/librte_ivshmem/rte_ivshmem.c: In function ‘add_mempool_to_metadata’:
DPDK/lib/librte_ivshmem/rte_ivshmem.c:584:32: error: ‘const struct rte_mempool’ has no member named ‘ring’
  return add_ring_to_metadata(mp->ring, config);
                                ^
compilation terminated due to -Wfatal-errors.
DPDK/mk/internal/rte.compile-pre.mk:126: recipe for target 'rte_ivshmem.o' failed
DPDK/mk/rte.subdir.mk:61: recipe for target 'librte_ivshmem' failed
DPDK/mk/rte.sdkbuild.mk:77: recipe for target 'lib' failed
DPDK/mk/rte.sdkroot.mk:123: recipe for target 'all' failed
DPDK/mk/rte.sdkinstall.mk:84: recipe for target 'pre_install' failed
DPDK/mk/rte.sdkroot.mk:98: recipe for target 'install' failed

Failure #17
FC21_64 / Linux 3.18.8-201 / ICC 15.0.0
Config: x86_64-native-linuxapp-icc
        CONFIG_RTE_LIBRTE_PMD_PCAP=y,
        CONFIG_RTE_NIC_BYPASS=y,
        CONFIG_RTE_BUILD_SHARED_LIB=y

DPDK/drivers/net/virtio/virtio_user/vhost_user.c(257): error #188: enumerated type mixed with another type
  	msg.request = req;
  	            ^
compilation aborted for DPDK/drivers/net/virtio/virtio_user/vhost_user.c (code 4)
DPDK/mk/internal/rte.compile-pre.mk:126: recipe for target 'virtio_user/vhost_user.o' failed
DPDK/mk/rte.subdir.mk:61: recipe for target 'virtio' failed
DPDK/mk/rte.subdir.mk:61: recipe for target 'net' failed
DPDK/mk/rte.sdkbuild.mk:77: recipe for target 'drivers' failed
DPDK/mk/rte.sdkroot.mk:123: recipe for target 'all' failed
DPDK/mk/rte.sdkinstall.mk:84: recipe for target 'pre_install' failed
DPDK/mk/rte.sdkroot.mk:98: recipe for target 'install' failed

Failure #18
RHEL70_64 / Linux 3.10.0-123 / ICC 14.0.0
Config: x86_64-native-linuxapp-icc
        CONFIG_RTE_LIBRTE_PMD_PCAP=y,
        CONFIG_RTE_NIC_BYPASS=y,
        CONFIG_RTE_BUILD_SHARED_LIB=y,
        CONFIG_RTE_LIBRTE_VHOST=y

DPDK/drivers/net/virtio/virtio_user/vhost_user.c(257): error #188: enumerated type mixed with another type
  	msg.request = req;
  	            ^
compilation aborted for DPDK/drivers/net/virtio/virtio_user/vhost_user.c (code 4)

Failure #19
RHEL70_64 / Linux 3.10.0-123 / GCC 4.8.2
Config: x86_64-native-ivshmem-gcc

DPDK/lib/librte_ivshmem/rte_ivshmem.c: In function ‘add_mempool_to_metadata’:
DPDK/lib/librte_ivshmem/rte_ivshmem.c:584:32: error: ‘const struct rte_mempool’ has no member named ‘ring’
  return add_ring_to_metadata(mp->ring, config);
                                ^
compilation terminated due to -Wfatal-errors.

Failure #20
RHEL70_64 / Linux 3.10.0-123 / ICC 14.0.0
Config: x86_64-native-ivshmem-icc

DPDK/lib/librte_ivshmem/rte_ivshmem.c: In function ‘add_mempool_to_metadata’:
DPDK/lib/librte_ivshmem/rte_ivshmem.c:584:32: error: ‘const struct rte_mempool’ has no member named ‘ring’
  return add_ring_to_metadata(mp->ring, config);
                                ^
compilation terminated due to -Wfatal-errors.

Failure #21
FC18_64 / Linux 3.6.10-4 / ICC 14.0.0
Config: x86_64-native-linuxapp-icc
        CONFIG_RTE_LIBRTE_PMD_PCAP=y,
        CONFIG_RTE_NIC_BYPASS=y,
        CONFIG_RTE_BUILD_SHARED_LIB=y,
        CONFIG_RTE_LIBRTE_VHOST=y

DPDK/drivers/net/virtio/virtio_user/vhost_user.c(257): error #188: enumerated type mixed with another type
  	msg.request = req;
  	            ^
compilation aborted for DPDK/drivers/net/virtio/virtio_user/vhost_user.c (code 4)

Failure #22
FC18_64 / Linux 3.6.10-4 / GCC 4.7.2
Config: x86_64-native-ivshmem-gcc

DPDK/lib/librte_ivshmem/rte_ivshmem.c: In function ‘add_mempool_to_metadata’:
DPDK/lib/librte_ivshmem/rte_ivshmem.c:584:32: error: ‘const struct rte_mempool’ has no member named ‘ring’
compilation terminated due to -Wfatal-errors.

Failure #23
FC18_64 / Linux 3.6.10-4 / ICC 14.0.0
Config: x86_64-native-ivshmem-icc

DPDK/lib/librte_ivshmem/rte_ivshmem.c: In function ‘add_mempool_to_metadata’:
DPDK/lib/librte_ivshmem/rte_ivshmem.c:584:32: error: ‘const struct rte_mempool’ has no member named ‘ring’
compilation terminated due to -Wfatal-errors.

Failure #24
FreeBSD10.0_64 / Linux 10.0-RELEASE / GCC 4.8.4
Config: x86_64-native-bsdapp-gcc
        CONFIG_RTE_BUILD_SHARED_LIB=y

LD librte_port.so.3.1
/usr/local/bin/ld: cannot find -lrte_kni
collect2: error: ld returned 1 exit status

Failure #25
FreeBSD10.0_64 / Linux 10.0-RELEASE / CLANG 3.3
Config: x86_64-native-bsdapp-clang
        CONFIG_RTE_BUILD_SHARED_LIB=y

LD librte_port.so.3.1
/usr/local/bin/ld: cannot find -lrte_kni
collect2: error: ld returned 1 exit status

Failure #26
FC20_64 / Linux 3.15.6-200 / GCC 4.8.2
Config: x86_64-native-ivshmem-gcc

DPDK/lib/librte_ivshmem/rte_ivshmem.c: In function ‘add_mempool_to_metadata’:
DPDK/lib/librte_ivshmem/rte_ivshmem.c:584:32: error: ‘const struct rte_mempool’ has no member named ‘ring’
  return add_ring_to_metadata(mp->ring, config);
                                ^
compilation terminated due to -Wfatal-errors.

Failure #27
FC20_64 / Linux 3.15.6-200 / ICC 14.0.0
Config: x86_64-native-ivshmem-icc

DPDK/lib/librte_ivshmem/rte_ivshmem.c: In function ‘add_mempool_to_metadata’:
DPDK/lib/librte_ivshmem/rte_ivshmem.c:584:32: error: ‘const struct rte_mempool’ has no member named ‘ring’
  return add_ring_to_metadata(mp->ring, config);
                                ^
compilation terminated due to -Wfatal-errors.

Failure #28
FC20_64 / Linux 3.15.6-200 / ICC 14.0.0
Config: x86_64-native-linuxapp-icc
        CONFIG_RTE_LIBRTE_PMD_PCAP=y,
        CONFIG_RTE_NIC_BYPASS=y,
        CONFIG_RTE_BUILD_SHARED_LIB=y

DPDK/drivers/net/virtio/virtio_user/vhost_user.c(257): error #188: enumerated type mixed with another type
  	msg.request = req;
  	            ^
compilation aborted for DPDK/drivers/net/virtio/virtio_user/vhost_user.c (code 4)

Successful builds :
UBT124_64 / Linux 3.8.0-29 / GCC 4.6.3
Config: x86_64-native-linuxapp-gcc
        CONFIG_RTE_LIBRTE_PMD_PCAP=y,
        CONFIG_RTE_NIC_BYPASS=y,
        CONFIG_RTE_BUILD_SHARED_LIB=y,
        CONFIG_RTE_LIBRTE_VHOST=y

UBT144_64 / Linux 3.13.0-30 / GCC 4.8.2
Config: x86_64-native-linuxapp-gcc
        CONFIG_RTE_LIBRTE_PMD_PCAP=y,
        CONFIG_RTE_NIC_BYPASS=y,
        CONFIG_RTE_BUILD_SHARED_LIB=y,
        CONFIG_RTE_LIBRTE_VHOST=y

FC21_64 / Linux 3.18.8-201 / GCC 4.9.2
Config: x86_64-native-linuxapp-gcc
        CONFIG_RTE_LIBRTE_PMD_PCAP=y,
        CONFIG_RTE_NIC_BYPASS=y,
        CONFIG_RTE_BUILD_SHARED_LIB=y,
        CONFIG_RTE_LIBRTE_VHOST=y

RHEL70_64 / Linux 3.10.0-123 / GCC 4.8.2
Config: x86_64-native-linuxapp-gcc
        CONFIG_RTE_LIBRTE_PMD_PCAP=y,
        CONFIG_RTE_NIC_BYPASS=y,
        CONFIG_RTE_BUILD_SHARED_LIB=y,
        CONFIG_RTE_LIBRTE_VHOST=y

FC18_64 / Linux 3.6.10-4 / GCC 4.7.2
Config: x86_64-native-linuxapp-gcc
        CONFIG_RTE_LIBRTE_PMD_PCAP=y,
        CONFIG_RTE_NIC_BYPASS=y,
        CONFIG_RTE_BUILD_SHARED_LIB=y,
        CONFIG_RTE_LIBRTE_VHOST=y

FC20_64 / Linux 3.15.6-200 / GCC 4.8.2
Config: x86_64-native-linuxapp-gcc
        enable_all_DEBUG_OPTION=y

FC20_64 / Linux 3.15.6-200 / CLANG 3.4
Config: x86_64-native-linuxapp-clang



More information about the test-report mailing list