[dpdk-test-report] |FAILURE| pw26334 [PATCH 3/3] vhost: check return value of pthread_mutex_init()

sys_stv at intel.com sys_stv at intel.com
Wed Jul 5 22:52:07 CEST 2017


Test-Label: Intel-compilation
Test-Status: FAILURE
http://dpdk.org/patch/26334

_apply patch file failure_

Submitter: Jens Freimann <jfreimann at redhat.com>
Date: Tue,  4 Jul 2017 10:50:41 +0200
DPDK git baseline: Repo:dpdk-next-eventdev, Branch:master, CommitID:9fc7090f258bb1a5b624f8ebbec551d0017c1399
                   Repo:dpdk-next-crypto, Branch:master, CommitID:90c21ceb6a1040bbc9ca611d0829987f2978225d
                   Repo:dpdk-next-net, Branch:master, CommitID:cb6294fdc3fced7c12219bae0ea8e62f02199aa1
                   Repo:dpdk-next-virtio, Branch:master, CommitID:98b53e38c195c0140d1b9d5b412986f3b92cfcf3
                   Repo:dpdk, Branch:master, CommitID:a3a2e2c8f7de433e10b1548df65b20bf10086d9c
                   
Apply patch file failed:
Repo: dpdk-next-virtio
26334:
patching file lib/librte_vhost/socket.c
Hunk #1 FAILED at 445.
1 out of 1 hunk FAILED -- saving rejects to file lib/librte_vhost/socket.c.rej


DPDK STV team


More information about the test-report mailing list