[dpdk-test-report] |FAILURE| pw24897 [PATCH v2 04/11] bus: add bus helper iterator to find a particular device

sys_stv at intel.com sys_stv at intel.com
Thu Jun 1 07:58:17 CEST 2017


Test-Label: Intel-compilation
Test-Status: FAILURE
http://dpdk.org/patch/24897

_apply patch file failure_

Submitter: Gaetan Rivet <gaetan.rivet at 6wind.com>
Date: Wed, 31 May 2017 15:17:49 +0200
DPDK git baseline: Repo:dpdk-next-eventdev, Branch:master, CommitID:7021fcbb2f5a4fc3e32f2bfd1a27f3dc671d3476
                   Repo:dpdk-next-crypto, Branch:master, CommitID:bc6ebd8c3e7391d3d0d909a9a068caf0f2171103
                   Repo:dpdk-next-net, Branch:master, CommitID:a290a691a71565c0216e628fff6ddbb49a16ce8e
                   Repo:dpdk-next-virtio, Branch:master, CommitID:1ee9702c260bbd4a282efdeaa7277ddbfc87177a
                   Repo:dpdk, Branch:master, CommitID:3047c857a7edae2a2685c8cd72f15dee9d3c2b22
                   
Apply patch file failed:
Repo: dpdk
24897:
patching file lib/librte_eal/bsdapp/eal/rte_eal_version.map
Hunk #1 FAILED at 164.
1 out of 1 hunk FAILED -- saving rejects to file lib/librte_eal/bsdapp/eal/rte_eal_version.map.rej
patching file lib/librte_eal/common/eal_common_bus.c
Hunk #1 succeeded at 145 with fuzz 2 (offset -37 lines).
patching file lib/librte_eal/common/include/rte_bus.h
Hunk #1 FAILED at 180.
1 out of 1 hunk FAILED -- saving rejects to file lib/librte_eal/common/include/rte_bus.h.rej
patching file lib/librte_eal/linuxapp/eal/rte_eal_version.map
Hunk #1 FAILED at 168.
1 out of 1 hunk FAILED -- saving rejects to file lib/librte_eal/linuxapp/eal/rte_eal_version.map.rej

Repo: dpdk-next-crypto
24897:
patching file lib/librte_eal/bsdapp/eal/rte_eal_version.map
Hunk #1 FAILED at 164.
1 out of 1 hunk FAILED -- saving rejects to file lib/librte_eal/bsdapp/eal/rte_eal_version.map.rej
patching file lib/librte_eal/common/eal_common_bus.c
Hunk #1 succeeded at 145 with fuzz 2 (offset -37 lines).
patching file lib/librte_eal/common/include/rte_bus.h
Hunk #1 FAILED at 180.
1 out of 1 hunk FAILED -- saving rejects to file lib/librte_eal/common/include/rte_bus.h.rej
patching file lib/librte_eal/linuxapp/eal/rte_eal_version.map
Hunk #1 FAILED at 168.
1 out of 1 hunk FAILED -- saving rejects to file lib/librte_eal/linuxapp/eal/rte_eal_version.map.rej

Repo: dpdk-next-net
24897:
patching file lib/librte_eal/bsdapp/eal/rte_eal_version.map
Hunk #1 FAILED at 164.
1 out of 1 hunk FAILED -- saving rejects to file lib/librte_eal/bsdapp/eal/rte_eal_version.map.rej
patching file lib/librte_eal/common/eal_common_bus.c
Hunk #1 succeeded at 145 with fuzz 2 (offset -37 lines).
patching file lib/librte_eal/common/include/rte_bus.h
Hunk #1 FAILED at 180.
1 out of 1 hunk FAILED -- saving rejects to file lib/librte_eal/common/include/rte_bus.h.rej
patching file lib/librte_eal/linuxapp/eal/rte_eal_version.map
Hunk #1 FAILED at 168.
1 out of 1 hunk FAILED -- saving rejects to file lib/librte_eal/linuxapp/eal/rte_eal_version.map.rej

Repo: dpdk-next-virtio
24897:
patching file lib/librte_eal/bsdapp/eal/rte_eal_version.map
Hunk #1 FAILED at 164.
1 out of 1 hunk FAILED -- saving rejects to file lib/librte_eal/bsdapp/eal/rte_eal_version.map.rej
patching file lib/librte_eal/common/eal_common_bus.c
Hunk #1 succeeded at 145 with fuzz 2 (offset -37 lines).
patching file lib/librte_eal/common/include/rte_bus.h
Hunk #1 FAILED at 180.
1 out of 1 hunk FAILED -- saving rejects to file lib/librte_eal/common/include/rte_bus.h.rej
patching file lib/librte_eal/linuxapp/eal/rte_eal_version.map
Hunk #1 FAILED at 168.
1 out of 1 hunk FAILED -- saving rejects to file lib/librte_eal/linuxapp/eal/rte_eal_version.map.rej

Repo: dpdk-next-eventdev
24897:
patching file lib/librte_eal/bsdapp/eal/rte_eal_version.map
Hunk #1 FAILED at 164.
1 out of 1 hunk FAILED -- saving rejects to file lib/librte_eal/bsdapp/eal/rte_eal_version.map.rej
patching file lib/librte_eal/common/eal_common_bus.c
Hunk #1 succeeded at 145 with fuzz 2 (offset -37 lines).
patching file lib/librte_eal/common/include/rte_bus.h
Hunk #1 FAILED at 180.
1 out of 1 hunk FAILED -- saving rejects to file lib/librte_eal/common/include/rte_bus.h.rej
patching file lib/librte_eal/linuxapp/eal/rte_eal_version.map
Hunk #1 FAILED at 168.
1 out of 1 hunk FAILED -- saving rejects to file lib/librte_eal/linuxapp/eal/rte_eal_version.map.rej


DPDK STV team


More information about the test-report mailing list