[dpdk-test-report] |FAILURE| pw25474 [PATCH v5 2/7] bus: introduce parsing functionality

sys_stv at intel.com sys_stv at intel.com
Wed Jun 21 11:56:26 CEST 2017


Test-Label: Intel-compilation
Test-Status: FAILURE
http://dpdk.org/patch/25474

_apply patch file failure_

Submitter: Gaetan Rivet <gaetan.rivet at 6wind.com>
Date: Wed, 21 Jun 2017 01:30:31 +0200
DPDK git baseline: Repo:dpdk-next-eventdev, Branch:master, CommitID:befbf45b614897c06b81e97ef565eead09342e1b
                   Repo:dpdk-next-crypto, Branch:master, CommitID:b1cac453935eb8d2f1dee8e7ab081711cfb0cf70
                   Repo:dpdk-next-net, Branch:master, CommitID:7de1b52b8b435cc2700a3e7155e99e209667f6c9
                   Repo:dpdk-next-virtio, Branch:master, CommitID:da5129d9b6b53375667690970f6824565c1f1443
                   Repo:dpdk, Branch:master, CommitID:3566af6be7f968c678a867399ddc644fb762873b
                   
Apply patch file failed:
Repo: dpdk
25474:
patching file lib/librte_eal/common/include/rte_bus.h
Hunk #1 succeeded at 82 with fuzz 1 (offset -35 lines).
Hunk #2 FAILED at 147.
1 out of 2 hunks FAILED -- saving rejects to file lib/librte_eal/common/include/rte_bus.h.rej

Repo: dpdk-next-crypto
25474:
patching file lib/librte_eal/common/include/rte_bus.h
Hunk #1 succeeded at 82 with fuzz 1 (offset -35 lines).
Hunk #2 FAILED at 147.
1 out of 2 hunks FAILED -- saving rejects to file lib/librte_eal/common/include/rte_bus.h.rej

Repo: dpdk-next-net
25474:
patching file lib/librte_eal/common/include/rte_bus.h
Hunk #1 succeeded at 82 with fuzz 1 (offset -35 lines).
Hunk #2 FAILED at 147.
1 out of 2 hunks FAILED -- saving rejects to file lib/librte_eal/common/include/rte_bus.h.rej

Repo: dpdk-next-virtio
25474:
patching file lib/librte_eal/common/include/rte_bus.h
Hunk #1 succeeded at 82 with fuzz 1 (offset -35 lines).
Hunk #2 FAILED at 147.
1 out of 2 hunks FAILED -- saving rejects to file lib/librte_eal/common/include/rte_bus.h.rej

Repo: dpdk-next-eventdev
25474:
patching file lib/librte_eal/common/include/rte_bus.h
Hunk #1 succeeded at 82 with fuzz 1 (offset -35 lines).
Hunk #2 FAILED at 147.
1 out of 2 hunks FAILED -- saving rejects to file lib/librte_eal/common/include/rte_bus.h.rej


DPDK STV team


More information about the test-report mailing list